Reaction Details
TargetMu-type opioid receptor
LigandBDBM50354644
Substrate/Competitorn/a
Meas. Tech.ChEMBL_771171 (CHEMBL1837088)
Ki 0.025000±n/a nM
Citation De Wachter, Rde Graaf, CKeresztes, AVandormael, BBallet, STóth, GRognan, DTourwé, D Synthesis, biological evaluation, and automated docking of constrained analogues of the opioid peptide H-Dmt-D-Ala-Phe-Gly-NH2 using the 4- or 5-methyl substituted 4-amino-1,2,4,5-tetrahydro-2-benzazepin-3-one scaffold. J Med Chem54:6538-47 (2011) 
 
Mu-type opioid receptor
Name:Mu-type opioid receptor
Type:G Protein-Coupled Receptor (GPCR)
Mol. Mass.:44503.11
Organism:Rattus norvegicus (rat)
Description:Competition binding assays were carried out using membrane preparations from transfected HN9.10 cells that constitutively expressed the mu opioid receptor.
Residue:398
BDBM50354644
NameBDBM50354644
Synonyms:CHEMBL1834218
TypeSmall organic molecule
Emp. Form.C27H35N5O5
Mol. Mass.509.5973
SMILESC[C@@H](NC(=O)[C@@H](N)Cc1c(C)cc(O)cc1C)C(=O)N[C@H]1[C@@H](C)c2ccccc2CN(CC(N)=O)C1=O