Reaction Details
TargetAcyl-CoA desaturase 1
LigandBDBM50354672
Substrate/Competitorn/a
Meas. Tech.ChEMBL_771237 (CHEMBL1839319)
IC50 1±n/a nM
Citation Ramtohul, YKPowell, DLeclerc, JPLeger, SOballa, RBlack, CIsabel, ELi, CSCrane, SRobichaud, JGuay, JGuiral, SZhang, LHuang, Z Bicyclic heteroaryl inhibitors of stearoyl-CoA desaturase: from systemic to liver-targeting inhibitors. Bioorg Med Chem Lett21:5692-6 (2011) 
 
Acyl-CoA desaturase 1
Name:Acyl-CoA desaturase 1
Type:Enzyme
Mol. Mass.:41485.97
Organism:Rattus norvegicus (Rat)
Description:P07308
Residue:358
BDBM50354672
NameBDBM50354672
Synonyms:CHEMBL1834453
TypeSmall organic molecule
Emp. Form.C16H15BrFN5OS
Mol. Mass.424.291
SMILESNc1nc2cnc(nc2s1)N1CCC(CC1)Oc1cc(F)ccc1Br