Reaction Details
TargetMelanocyte-stimulating hormone receptor
LigandBDBM50354718
Substrate/Competitorn/a
Meas. Tech.ChEMBL_771453 (CHEMBL1837213)
IC50 0.250000±n/a nM
Citation Baumhover, NJMartin, MEParameswarappa, SGKloepping, KCO'Dorisio, MSPigge, FCSchultz, MK Improved synthesis and biological evaluation of chelator-modifieda-MSH analogs prepared by copper-free click chemistry. Bioorg Med Chem Lett21:5757-61 (2011) 
 
Melanocyte-stimulating hormone receptor
Name:Melanocyte-stimulating hormone receptor
Type:PROTEIN
Mol. Mass.:35238.60
Organism:Mus musculus
Description:ChEMBL_1498846
Residue:315
BDBM50354718
NameBDBM50354718
Synonyms:CHEMBL1834392
TypeSmall organic molecule
Emp. Form.C82H120N24O18
Mol. Mass.1729.9802
SMILESCCCC[C@H](NC(=O)[C@H](CO)NC(=O)[C@H](Cc1ccc(O)cc1)NC(=O)[C@H](CO)NCCCCCCN=[N+]=[N-])C(=O)N[C@@H](CCC(O)=O)C(=O)N[C@@H](Cc1cnc[nH]1)C(=O)N[C@H](Cc1ccccc1)C(=O)N[C@@H](CCCN=C(N)N)C(=O)N[C@@H](Cc1c[nH]c2ccccc12)C(=O)NCC(=O)N[C@@H](CCCCN)C(=O)N1CCC[C@H]1C(=O)N[C@@H](C(C)C)C(N)=O