Reaction Details
TargetCannabinoid receptor 2
LigandBDBM50354807
Substrate/Competitorn/a
Meas. Tech.ChEMBL_771754 (CHEMBL1838496)
Ki 1790±n/a nM
Citation Fulp, ABortoff, KZhang, YSeltzman, HSnyder, RMaitra, R Towards rational design of cannabinoid receptor 1 (CB1) antagonists for peripheral selectivity. Bioorg Med Chem Lett21:5711-4 (2011) 
 
Cannabinoid receptor 2
Name:Cannabinoid receptor 2
Type:G Protein-Coupled Receptor (GPCR)
Mol. Mass.:39690.94
Organism:Homo sapiens (Human)
Description:P34972
Residue:360
BDBM50354807
NameBDBM50354807
Synonyms:CHEMBL1834277
TypeSmall organic molecule
Emp. Form.C25H28Cl3N5O3S
Mol. Mass.584.946
SMILESCc1c(nn(c1-c1ccc(Cl)cc1)-c1ccc(Cl)cc1Cl)C(=O)NC[C@H]1CC[C@@H](CNS(N)(=O)=O)CC1