Reaction Details
TargetCannabinoid receptor 1
LigandBDBM50354806
Substrate/Competitorn/a
Meas. Tech.ChEMBL_771755 (CHEMBL1838497)
Ki 1698±n/a nM
Citation Fulp, ABortoff, KZhang, YSeltzman, HSnyder, RMaitra, R Towards rational design of cannabinoid receptor 1 (CB1) antagonists for peripheral selectivity. Bioorg Med Chem Lett21:5711-4 (2011) 
 
Cannabinoid receptor 1
Name:Cannabinoid receptor 1
Type:G Protein-Coupled Receptor (GPCR)
Mol. Mass.:52868.96
Organism:Homo sapiens (Human)
Description:P21554
Residue:472
BDBM50354806
NameBDBM50354806
Synonyms:CHEMBL1834008
TypeSmall organic molecule
Emp. Form.C24H20Cl3N4O
Mol. Mass.486.8
SMILESCc1c(nn(c1-c1ccc(Cl)cc1)-c1ccc(Cl)cc1Cl)C(=O)Nc1ccc(C)[n+](C)c1