Reaction Details
TargetHistone deacetylase 4
LigandBDBM25164
Substrate/Competitorn/a
Meas. Tech.ChEMBL_771089 (CHEMBL1838750)
IC50 367±n/a nM
Citation Ilies, MDowling, DPLombardi, PMChristianson, DW Synthesis of a new trifluoromethylketone analogue of l-arginine and contrasting inhibitory activity against human arginase I and histone deacetylase 8. Bioorg Med Chem Lett21:5854-8 (2011) 
 
Histone deacetylase 4
Name:Histone deacetylase 4
Type:Enzyme
Mol. Mass.:119049.39
Organism:Homo sapiens (Human)
Description:P56524
Residue:1084
BDBM25164
NameBDBM25164
Synonyms:2,2,2-trifluoro-1-[5-({3-phenyl-5H,6H,7H,8H-imidazo[1,2-a]pyrazin-7-yl}carbonyl)thiophen-2-yl]ethan-1-one thiophene derivative, 3j
TypeSmall organic molecule
Emp. Form.C19H14F3N3O2S
Mol. Mass.405.394
SMILESFC(F)(F)C(=O)c1ccc(s1)C(=O)N1CCn2c(C1)ncc2-c1ccccc1