Reaction Details
TargetCannabinoid receptor 1
LigandBDBM50354844
Substrate/Competitorn/a
Meas. Tech.ChEMBL_772345 (CHEMBL1838790)
Ki 1900±n/a nM
Citation Teng, HThakur, GAMakriyannis, A Conformationally constrained analogs of BAY 59-3074 as novel cannabinoid receptor ligands. Bioorg Med Chem Lett21:5999-6002 (2011) 
 
Cannabinoid receptor 1
Name:Cannabinoid receptor 1
Type:G Protein-Coupled Receptor (GPCR)
Mol. Mass.:52856.55
Organism:Rattus norvegicus (rat)
Description:P20272
Residue:473
BDBM50354844
NameBDBM50354844
Synonyms:CHEMBL1834522
TypeSmall organic molecule
Emp. Form.C18H11F6NO4S
Mol. Mass.451.34
SMILESFC(F)(F)CCCS(=O)(=O)Oc1cccc2oc3c(C#N)c(ccc3c12)C(F)(F)F