Reaction Details
TargetCannabinoid receptor 1
LigandBDBM50354848
Substrate/Competitorn/a
Meas. Tech.ChEMBL_772345 (CHEMBL1838790)
Ki 14400±n/a nM
Citation Teng, HThakur, GAMakriyannis, A Conformationally constrained analogs of BAY 59-3074 as novel cannabinoid receptor ligands. Bioorg Med Chem Lett21:5999-6002 (2011) 
 
Cannabinoid receptor 1
Name:Cannabinoid receptor 1
Type:G Protein-Coupled Receptor (GPCR)
Mol. Mass.:52856.55
Organism:Rattus norvegicus (rat)
Description:P20272
Residue:473
BDBM50354848
NameBDBM50354848
Synonyms:CHEMBL1834526
TypeSmall organic molecule
Emp. Form.C19H13F6NO4S
Mol. Mass.465.366
SMILESFC(F)(F)CCCS(=O)(=O)Oc1cccc2Cc3ccc(c(C#N)c3Oc12)C(F)(F)F