Reaction Details
TargetCannabinoid receptor 2
LigandBDBM50354846
Substrate/Competitorn/a
Meas. Tech.ChEMBL_772347 (CHEMBL1838792)
Ki 317±n/a nM
Citation Teng, HThakur, GAMakriyannis, A Conformationally constrained analogs of BAY 59-3074 as novel cannabinoid receptor ligands. Bioorg Med Chem Lett21:5999-6002 (2011) 
 
Cannabinoid receptor 2
Name:Cannabinoid receptor 2
Type:G Protein-Coupled Receptor (GPCR)
Mol. Mass.:39690.94
Organism:Homo sapiens (Human)
Description:P34972
Residue:360
BDBM50354846
NameBDBM50354846
Synonyms:CHEMBL1834524
TypeSmall organic molecule
Emp. Form.C18H11F6NO4S
Mol. Mass.451.34
SMILESFC(F)(F)CCCS(=O)(=O)Oc1ccc2c(c1)oc1c(C#N)c(ccc21)C(F)(F)F