Reaction Details
TargetGlucocorticoid receptor
LigandBDBM50354849
Substrate/Competitorn/a
Meas. Tech.ChEMBL_772356 (CHEMBL1838801)
EC50 1.09±n/a nM
Citation Millan, DSBallard, SAChunn, SDybowski, JAFulton, CKGlossop, PAGuillabert, EHewson, CAJones, RMLamb, DJNapier, CMPayne-Cook, TARenery, ERSelby, MDTutt, MFYeadon, M Design and synthesis of long acting inhaled corticosteroids for the treatment of asthma. Bioorg Med Chem Lett21:5826-30 (2011) 
 
Glucocorticoid receptor
Name:Glucocorticoid receptor
Type:Enzyme
Mol. Mass.:85656.87
Organism:Homo sapiens (Human)
Description:P04150
Residue:777
BDBM50354849
NameBDBM50354849
Synonyms:CCI-18781 FLUTICASONE PROPIONATE Flovent Flovent diskus 250 Flovent hfa US10869929, Compound FLUTICASONE PROPIONATE
TypeSmall organic molecule
Emp. Form.C25H31F3O5S
Mol. Mass.500.571
SMILESCCC(=O)O[C@@]1([C@H](C)C[C@H]2[C@@H]3C[C@H](F)C4=CC(=O)C=C[C@]4(C)[C@@]3(F)[C@@H](O)C[C@]12C)C(=O)SCF