Reaction Details
TargetCytochrome P450 2C19
LigandBDBM50354895
Substrate/Competitorn/a
Meas. Tech.ChEMBL_772752 (CHEMBL1837364)
IC50>30000±n/a nM
Citation Johnson, PSRyckmans, TBryans, JBeal, DMDack, KNFeeder, NHarrison, ALewis, MMason, HJMills, JNewman, JPasquinet, CRawson, DJRoberts, LRRussell, RSpark, DStobie, AUnderwood, TJWard, RWheeler, S Discovery of PF-184563, a potent and selective V1a antagonist for the treatment of dysmenorrhoea. The influence of compound flexibility on microsomal stability. Bioorg Med Chem Lett21:5684-7 (2011) 
 
Cytochrome P450 2C19
Name:Cytochrome P450 2C19
Type:Enzyme
Mol. Mass.:55935.47
Organism:Homo sapiens (Human)
Description:P33261
Residue:490
BDBM50354895
NameBDBM50354895
Synonyms:CHEMBL1837038
TypeSmall organic molecule
Emp. Form.C22H23ClN6O2
Mol. Mass.438.91
SMILESCOC(=O)N1Cc2nnc(C3CCN(CC3)c3ccccn3)n2-c2ccc(Cl)cc2C1