Reaction Details
TargetCytochrome P450 2D6
LigandBDBM50354897
Substrate/Competitorn/a
Meas. Tech.ChEMBL_772753 (CHEMBL1837365)
IC50>30000±n/a nM
Citation Johnson, PSRyckmans, TBryans, JBeal, DMDack, KNFeeder, NHarrison, ALewis, MMason, HJMills, JNewman, JPasquinet, CRawson, DJRoberts, LRRussell, RSpark, DStobie, AUnderwood, TJWard, RWheeler, S Discovery of PF-184563, a potent and selective V1a antagonist for the treatment of dysmenorrhoea. The influence of compound flexibility on microsomal stability. Bioorg Med Chem Lett21:5684-7 (2011) 
 
Cytochrome P450 2D6
Name:Cytochrome P450 2D6
Type:Protein
Mol. Mass.:55774.82
Organism:Homo sapiens (Human)
Description:P10635
Residue:497
BDBM50354897
NameBDBM50354897
Synonyms:CHEMBL1837041
TypeSmall organic molecule
Emp. Form.C21H23ClN6O2S
Mol. Mass.458.964
SMILESCS(=O)(=O)N1Cc2nnc(C3CCN(CC3)c3ccccn3)n2-c2ccc(Cl)cc2C1