Reaction Details
TargetVasopressin V1a receptor
LigandBDBM50354894
Substrate/Competitorn/a
Meas. Tech.ChEMBL_772742 (CHEMBL1837354)
IC50 6.7±n/a nM
Citation Johnson, PSRyckmans, TBryans, JBeal, DMDack, KNFeeder, NHarrison, ALewis, MMason, HJMills, JNewman, JPasquinet, CRawson, DJRoberts, LRRussell, RSpark, DStobie, AUnderwood, TJWard, RWheeler, S Discovery of PF-184563, a potent and selective V1a antagonist for the treatment of dysmenorrhoea. The influence of compound flexibility on microsomal stability. Bioorg Med Chem Lett21:5684-7 (2011) 
 
Vasopressin V1a receptor
Name:Vasopressin V1a receptor
Type:Receptor
Mol. Mass.:46820.18
Organism:Homo sapiens (Human)
Description:P37288
Residue:418
BDBM50354894
NameBDBM50354894
Synonyms:CHEMBL1837037
TypeSmall organic molecule
Emp. Form.C21H23ClN6
Mol. Mass.394.901
SMILESCN1Cc2nnc(C3CCN(CC3)c3ccccn3)n2-c2ccc(Cl)cc2C1