Reaction Details
TargetMu-type opioid receptor
LigandBDBM50354994
Substrate/Competitorn/a
Meas. Tech.ChEMBL_772110 (CHEMBL1837876)
Ki 0.771±n/a nM
Citation Nagase, HKoyano, KWada, NHirayama, SWatanabe, ANemoto, TNakajima, MNakao, KMochizuki, HFujii, H Synthesis of novel triplet drugs with 1,3,5-trioxazatriquinane skeletons and their pharmacologies. Part 2: Synthesis of novel triplet drugs with the epoxymethano structure (capped homotriplet). Bioorg Med Chem Lett21:6198-202 (2011) 
 
Mu-type opioid receptor
Name:Mu-type opioid receptor
Type:Enzyme Catalytic Domain
Mol. Mass.:44431.62
Organism:MOUSE
Description:OPIATE Mu OPRM1 MOUSE::P42866
Residue:398
BDBM50354994
NameBDBM50354994
Synonyms:CHEMBL1834899
TypeSmall organic molecule
Emp. Form.C44H55N3O7
Mol. Mass.737.9234
SMILESOc1ccc2C[C@H]3N(CC4CC4)CC[C@@]4(C[C@]5(CC[C@@]34O)O[C@H]3CO[C@@H]4N3[C@H]5O[C@]43CC[C@@]4(O)[C@H]5Cc6ccc(O)cc6[C@@]4(CCN5CC4CC4)C3)c2c1