Reaction Details
TargetDelta-type opioid receptor
LigandBDBM50354995
Substrate/Competitorn/a
Meas. Tech.ChEMBL_772111 (CHEMBL1837877)
Ki 7.797±n/a nM
Citation Nagase, HKoyano, KWada, NHirayama, SWatanabe, ANemoto, TNakajima, MNakao, KMochizuki, HFujii, H Synthesis of novel triplet drugs with 1,3,5-trioxazatriquinane skeletons and their pharmacologies. Part 2: Synthesis of novel triplet drugs with the epoxymethano structure (capped homotriplet). Bioorg Med Chem Lett21:6198-202 (2011) 
 
Delta-type opioid receptor
Name:Delta-type opioid receptor
Type:Enzyme Catalytic Domain
Mol. Mass.:40577.25
Organism:MOUSE
Description:P32300
Residue:372
BDBM50354995
NameBDBM50354995
Synonyms:CHEMBL1834900
TypeSmall organic molecule
Emp. Form.C44H51N3O7
Mol. Mass.733.8916
SMILESOc1ccc2C[C@@H]3[C@@H]4CC[C@]5(O[C@H]6CO[C@@H]7N6[C@H]5O[C@]75CC[C@H]6[C@H]7Cc8ccc(O)c9O[C@@H]5[C@]6(CCN7CC5CC5)c89)[C@@H]5Oc1c2[C@]45CCN3CC1CC1