Reaction Details
TargetCystine/glutamate transporter
LigandBDBM50355003
Substrate/Competitorn/a
Meas. Tech.ChEMBL_772170 (CHEMBL1838227)
IC50 900000±n/a nM
Citation Shukla, KThomas, AGFerraris, DVHin, NSattler, RAlt, JRojas, CSlusher, BSTsukamoto, T Inhibition of xc¿?¿ transporter-mediated cystine uptake by sulfasalazine analogs. Bioorg Med Chem Lett21:6184-7 (2011) 
 
Cystine/glutamate transporter
Name:Cystine/glutamate transporter
Type:PROTEIN
Mol. Mass.:55437.48
Organism:Homo sapiens (Human)
Description:ChEMBL_772170
Residue:501
BDBM50355003
NameBDBM50355003
Synonyms:CHEMBL1834955
TypeSmall organic molecule
Emp. Form.C21H18N2O5S
Mol. Mass.410.443
SMILESCOC(=O)c1cc(\C=C\c2ccc(cc2)S(=O)(=O)Nc2ccccn2)ccc1O