Reaction Details
TargetCystine/glutamate transporter
LigandBDBM50355007
Substrate/Competitorn/a
Meas. Tech.ChEMBL_772170 (CHEMBL1838227)
IC50 75000±n/a nM
Citation Shukla, KThomas, AGFerraris, DVHin, NSattler, RAlt, JRojas, CSlusher, BSTsukamoto, T Inhibition of xc¿?¿ transporter-mediated cystine uptake by sulfasalazine analogs. Bioorg Med Chem Lett21:6184-7 (2011) 
 
Cystine/glutamate transporter
Name:Cystine/glutamate transporter
Type:PROTEIN
Mol. Mass.:55437.48
Organism:Homo sapiens (Human)
Description:ChEMBL_772170
Residue:501
BDBM50355007
NameBDBM50355007
Synonyms:CHEMBL1834959
TypeSmall organic molecule
Emp. Form.C20H14N2O4S
Mol. Mass.378.401
SMILESOC(=O)c1cccc(c1)C#Cc1ccc(cc1)S(=O)(=O)Nc1ccccn1