Reaction Details
TargetB1 bradykinin receptor
LigandBDBM50344100
Substrate/Competitorn/a
Meas. Tech.ChEMBL_772771 (CHEMBL1837510)
IC50 4.1±n/a nM
Citation Biswas, KPeterkin, TABryan, MCArik, LLehto, SGSun, HHsieh, FYXu, CFremeau, RTAllen, JR Discovery of potent, orally bioavailable phthalazinone bradykinin B1 receptor antagonists. J Med Chem54:7232-46 (2011) 
 
B1 bradykinin receptor
Name:B1 bradykinin receptor
Type:PROTEIN
Mol. Mass.:39519.62
Organism:Oryctolagus cuniculus
Description:ChEMBL_796432
Residue:352
BDBM50344100
NameBDBM50344100
Synonyms:2-((2R)-1-((4-methylphenyl)sulfonyl)-3-oxo-2-piperazinyl)-N-((1R)-6-(1-piperidinylmethyl)-1,2,3,4-tetrahydro-1-naphthalenyl)acetamide | CHEMBL1777958
TypeSmall organic molecule
Emp. Form.C29H38N4O4S
Mol. Mass.538.701
SMILESCc1ccc(cc1)S(=O)(=O)N1CCNC(=O)[C@H]1CC(=O)N[C@@H]1CCCc2cc(CN3CCCCC3)ccc12