Reaction Details
TargetB1 bradykinin receptor
LigandBDBM50355058
Substrate/Competitorn/a
Meas. Tech.ChEMBL_772771 (CHEMBL1837510)
IC50 17.5±n/a nM
Citation Biswas, KPeterkin, TABryan, MCArik, LLehto, SGSun, HHsieh, FYXu, CFremeau, RTAllen, JR Discovery of potent, orally bioavailable phthalazinone bradykinin B1 receptor antagonists. J Med Chem54:7232-46 (2011) 
 
B1 bradykinin receptor
Name:B1 bradykinin receptor
Type:PROTEIN
Mol. Mass.:39519.62
Organism:Oryctolagus cuniculus
Description:ChEMBL_796432
Residue:352
BDBM50355058
NameBDBM50355058
Synonyms:CHEMBL1834750
TypeSmall organic molecule
Emp. Form.C31H31ClN4O3
Mol. Mass.543.056
SMILESCc1nn(-c2ccc(cc2)C(=O)N[C@@H]2CCOc3cc(CN4CCCCC4)ccc23)c(=O)c2c(Cl)cccc12