Reaction Details
TargetB1 bradykinin receptor
LigandBDBM50355059
Substrate/Competitorn/a
Meas. Tech.ChEMBL_772771 (CHEMBL1837510)
IC50 31.1±n/a nM
Citation Biswas, KPeterkin, TABryan, MCArik, LLehto, SGSun, HHsieh, FYXu, CFremeau, RTAllen, JR Discovery of potent, orally bioavailable phthalazinone bradykinin B1 receptor antagonists. J Med Chem54:7232-46 (2011) 
 
B1 bradykinin receptor
Name:B1 bradykinin receptor
Type:PROTEIN
Mol. Mass.:39519.62
Organism:Oryctolagus cuniculus
Description:ChEMBL_796432
Residue:352
BDBM50355059
NameBDBM50355059
Synonyms:CHEMBL1834620
TypeSmall organic molecule
Emp. Form.C31H32ClN5O2
Mol. Mass.542.071
SMILESCc1nn(-c2ccc(nc2)C(=O)N[C@@H]2CCCc3cc(CN4CCCCC4)ccc23)c(=O)c2c(Cl)cccc12