Reaction Details
TargetB1 bradykinin receptor
LigandBDBM50355069
Substrate/Competitorn/a
Meas. Tech.ChEMBL_772684 (CHEMBL1837152)
Ki 64±n/a nM
Citation Biswas, KPeterkin, TABryan, MCArik, LLehto, SGSun, HHsieh, FYXu, CFremeau, RTAllen, JR Discovery of potent, orally bioavailable phthalazinone bradykinin B1 receptor antagonists. J Med Chem54:7232-46 (2011) 
 
B1 bradykinin receptor
Name:B1 bradykinin receptor
Type:Enzyme
Mol. Mass.:40508.87
Organism:Homo sapiens (Human)
Description:P46663
Residue:353
BDBM50355069
NameBDBM50355069
Synonyms:CHEMBL1835756
TypeSmall organic molecule
Emp. Form.C32H32N2O3
Mol. Mass.492.6081
SMILESO=C(N[C@@H]1CCCc2cc(CN3CCCCC3)ccc12)c1cccc(c1)-c1coc2ccccc2c1=O