Reaction Details
TargetKallikrein-7
LigandBDBM50355086
Substrate/Competitorn/a
Meas. Tech.ChEMBL_772793 (CHEMBL1837532)
Ki 12200±n/a nM
Citation Teixeira, TSFreitas, RFAbrahão, ODevienne, KFde Souza, LRBlaber, SIBlaber, MKondo, MYJuliano, MAJuliano, LPuzer, L Biological evaluation and docking studies of natural isocoumarins as inhibitors for human kallikrein 5 and 7. Bioorg Med Chem Lett21:6112-5 (2011) 
 
Kallikrein-7
Name:Kallikrein-7
Type:PROTEIN
Mol. Mass.:27535.05
Organism:Homo sapiens (Human)
Description:ChEMBL_1469257
Residue:253
BDBM50355086
NameBDBM50355086
Synonyms:CHEMBL1834753
TypeSmall organic molecule
Emp. Form.C32H26O12
Mol. Mass.602.5416
SMILESCOc1cc2c(OC)c3cc(C)oc(=O)c3c(O)c2c(O)c1-c1c(OC)cc2c(OC)c3cc(C)oc(=O)c3c(O)c2c1O