Reaction Details
TargetCaspase-2
LigandBDBM50355103
Substrate/Competitorn/a
Meas. Tech.ChEMBL_773169 (CHEMBL1838645)
IC50 6670±n/a nM
Citation Maillard, MCBrookfield, FACourtney, SMEustache, FMGemkow, MJHandel, RKJohnson, LCJohnson, PDKerry, MAKrieger, FMeniconi, MMuñoz-Sanjuán, IPalfrey, JJPark, HSchaertl, STaylor, MGWeddell, DDominguez, C Exploiting differences in caspase-2 and -3 S2 subsites for selectivity: structure-based design, solid-phase synthesis and in vitro activity of novel substrate-based caspase-2 inhibitors. Bioorg Med Chem19:5833-51 (2011) 
 
Caspase-2
Name:Caspase-2
Type:Enzyme
Mol. Mass.:50688.29
Organism:Homo sapiens (Human)
Description:P42575
Residue:452
BDBM50355103
NameBDBM50355103
Synonyms:CHEMBL1835399
TypeSmall organic molecule
Emp. Form.C31H43N5O10
Mol. Mass.645.7006
SMILESCC(C)[C@H](NC(C)=O)C(=O)N[C@@H](CC(O)=O)C(=O)N[C@@H](C(C)C)C(=O)N1CCc2cc(C)ccc2C1C(=O)N[C@H]1CC(=O)OC1O