Reaction Details
TargetCaspase-3
LigandBDBM50355096
Substrate/Competitorn/a
Meas. Tech.ChEMBL_773167 (CHEMBL1838643)
IC50 2765±n/a nM
Citation Maillard, MCBrookfield, FACourtney, SMEustache, FMGemkow, MJHandel, RKJohnson, LCJohnson, PDKerry, MAKrieger, FMeniconi, MMuñoz-Sanjuán, IPalfrey, JJPark, HSchaertl, STaylor, MGWeddell, DDominguez, C Exploiting differences in caspase-2 and -3 S2 subsites for selectivity: structure-based design, solid-phase synthesis and in vitro activity of novel substrate-based caspase-2 inhibitors. Bioorg Med Chem19:5833-51 (2011) 
 
Caspase-3
Name:Caspase-3
Type:Hydrolase; heterotetramer of two heterodimers
Mol. Mass.:31607.55
Organism:Homo sapiens (Human)
Description:n/a
Residue:277
BDBM50355096
NameBDBM50355096
Synonyms:CHEMBL1835319
TypeSmall organic molecule
Emp. Form.C32H45N5O10
Mol. Mass.659.7272
SMILESCC(C)[C@H](NC(C)=O)C(=O)N[C@@H](CC(O)=O)C(=O)N[C@@H](C(C)C)C(=O)N1CC[C@@H]([C@H]1C(=O)N[C@H]1CC(=O)OC1O)c1ccc(C)cc1