Reaction Details
TargetCaspase-2
LigandBDBM50355096
Substrate/Competitorn/a
Meas. Tech.ChEMBL_773166 (CHEMBL1838642)
IC50 1600±n/a nM
Citation Maillard, MCBrookfield, FACourtney, SMEustache, FMGemkow, MJHandel, RKJohnson, LCJohnson, PDKerry, MAKrieger, FMeniconi, MMuñoz-Sanjuán, IPalfrey, JJPark, HSchaertl, STaylor, MGWeddell, DDominguez, C Exploiting differences in caspase-2 and -3 S2 subsites for selectivity: structure-based design, solid-phase synthesis and in vitro activity of novel substrate-based caspase-2 inhibitors. Bioorg Med Chem19:5833-51 (2011) 
 
Caspase-2
Name:Caspase-2
Type:Enzyme
Mol. Mass.:50688.29
Organism:Homo sapiens (Human)
Description:P42575
Residue:452
BDBM50355096
NameBDBM50355096
Synonyms:CHEMBL1835319
TypeSmall organic molecule
Emp. Form.C32H45N5O10
Mol. Mass.659.7272
SMILESCC(C)[C@H](NC(C)=O)C(=O)N[C@@H](CC(O)=O)C(=O)N[C@@H](C(C)C)C(=O)N1CC[C@@H]([C@H]1C(=O)N[C@H]1CC(=O)OC1O)c1ccc(C)cc1