Reaction Details
TargetNeuronal acetylcholine receptor subunit alpha-4/beta-2
LigandBDBM50419266
Substrate/Competitorn/a
Meas. Tech.ChEMBL_772128 (CHEMBL1838047)
EC50 25±n/a nM
Citation Liu, JYu, LFEaton, JBCaldarone, BCavino, KRuiz, CTerry, MFedolak, AWang, DGhavami, ALowe, DABrunner, DLukas, RJKozikowski, AP Discovery of isoxazole analogues of sazetidine-A as selectivea4ß2-nicotinic acetylcholine receptor partial agonists for the treatment of depression. J Med Chem54:7280-8 (2011) 
 
Neuronal acetylcholine receptor subunit alpha-4/beta-2
Name:Neuronal acetylcholine receptor subunit alpha-4/beta-2
Type:Protein
Mol. Mass.:n/a
Description:n/a
Components:This complex has 2 components.
Component 1
Name:Neuronal acetylcholine receptor subunit alpha-4
Synonyms:ACHA4_HUMAN CHRNA4 protein Neuronal acetylcholine receptor protein alpha-4 subunit Nicotinic acetylcholine receptor alpha4/beta2/alpha5
Type:n/a
Mol. Mass.:69963.49
Organism:Homo sapiens (Human)
Description:NACHRA4
Residue:627
Component 2
Name:Neuronal acetylcholine receptor subunit beta-2
Synonyms:ACHB2_HUMAN Neuronal acetylcholine receptor protein beta-2 subunit | Nicotinic acetylcholine receptor alpha3/beta2/alpha5
Type:Protein
Mol. Mass.:57020.50
Organism:Homo sapiens (Human)
Description:P17787
Residue:502
BDBM50419266
NameBDBM50419266
Synonyms:CHEMBL1835610
TypeSmall organic molecule
Emp. Form.C13H15N3O3
Mol. Mass.261.2765
SMILESOCc1cc(on1)-c1cncc(OC[C@@H]2CCN2)c1