Reaction Details
TargetDiacylglycerol O-acyltransferase 1
LigandBDBM50355143
Substrate/Competitorn/a
Meas. Tech.ChEMBL_772695 (CHEMBL1837163)
IC50 265±n/a nM
Citation Dow, RLAndrews, MAspnes, GEBalan, GMichael Gibbs, EGuzman-Perez, AKarki, KLaperle, JLLi, JCLitchfield, JMunchhof, MJPerreault, CPatel, L Design and synthesis of potent, orally-active DGAT-1 inhibitors containing a dioxino[2,3-d]pyrimidine core. Bioorg Med Chem Lett21:6122-5 (2011) 
 
Diacylglycerol O-acyltransferase 1
Name:Diacylglycerol O-acyltransferase 1
Type:Protein
Mol. Mass.:55297.82
Organism:Homo sapiens (Human)
Description:O75907
Residue:488
BDBM50355143
NameBDBM50355143
Synonyms:CHEMBL1835920
TypeSmall organic molecule
Emp. Form.C22H28N4O3
Mol. Mass.396.4827
SMILESCC1(C)Oc2ncnc(N)c2NC1c1ccc(cc1)[C@H]1CC[C@H](CC(O)=O)CC1