Reaction Details
TargetDiacylglycerol O-acyltransferase 1
LigandBDBM50355149
Substrate/Competitorn/a
Meas. Tech.ChEMBL_772696 (CHEMBL1837164)
IC50 735±n/a nM
Citation Dow, RLAndrews, MAspnes, GEBalan, GMichael Gibbs, EGuzman-Perez, AKarki, KLaperle, JLLi, JCLitchfield, JMunchhof, MJPerreault, CPatel, L Design and synthesis of potent, orally-active DGAT-1 inhibitors containing a dioxino[2,3-d]pyrimidine core. Bioorg Med Chem Lett21:6122-5 (2011) 
 
Diacylglycerol O-acyltransferase 1
Name:Diacylglycerol O-acyltransferase 1
Type:Protein
Mol. Mass.:55297.82
Organism:Homo sapiens (Human)
Description:O75907
Residue:488
BDBM50355149
NameBDBM50355149
Synonyms:CHEMBL1834558
TypeSmall organic molecule
Emp. Form.C21H25N3O4
Mol. Mass.383.4409
SMILESCC1(COc2ncnc(N)c2O1)c1ccc(cc1)[C@H]1CC[C@H](CC(O)=O)CC1