Reaction Details
TargetSialidase
LigandBDBM50355212
Substrate/Competitorn/a
Meas. Tech.ChEMBL_772884 (CHEMBL1838287)
IC50 170±n/a nM
Citation Woo, HSKim, DWCurtis-Long, MJLee, BWLee, JHKim, JYKang, JEPark, KH Potent inhibition of bacterial neuraminidase activity by pterocarpans isolated from the roots of Lespedeza bicolor. Bioorg Med Chem Lett21:6100-3 (2011) 
 
Sialidase
Name:Sialidase
Type:PROTEIN
Mol. Mass.:42808.79
Organism:Clostridium perfringens
Description:ChEMBL_991336
Residue:382
BDBM50355212
NameBDBM50355212
Synonyms:CHEMBL1835717
TypeSmall organic molecule
Emp. Form.C26H30O5
Mol. Mass.422.5134
SMILES[#6]-[#8]-c1cc(-[#8])c(-[#6]\[#6]=[#6](/[#6])-[#6]-[#6]\[#6]=[#6](\[#6])-[#6])c2-[#8]-[#6]-[#6@@H]-3-[#6@@H](-[#8]-c4cc(-[#8])ccc-34)-c12