Reaction Details
TargetHistone deacetylase 8
LigandBDBM50355351
Substrate/Competitorn/a
Meas. Tech.ChEMBL_773032 (CHEMBL1838458)
IC50 21±n/a nM
Citation Zhang, YFeng, JJia, YXu, YLiu, CFang, HXu, W Design, synthesis and primary activity assay of tripeptidomimetics as histone deacetylase inhibitors with linear linker and branched cap group. Eur J Med Chem46:5387-97 (2011) 
 
Histone deacetylase 8
Name:Histone deacetylase 8
Type:Enzyme
Mol. Mass.:41749.60
Organism:Homo sapiens (Human)
Description:Q9BY41
Residue:377
BDBM50355351
NameBDBM50355351
Synonyms:CHEMBL1835418
TypeSmall organic molecule
Emp. Form.C27H40N4O7S2
Mol. Mass.596.759
SMILESCC(C)(C)OC(=O)N[C@@H](Cc1ccc(O)cc1)C(=O)N1CC2(C[C@H]1C(=O)NCCCCCC(=O)NO)SCCS2