Reaction Details
TargetSteryl-sulfatase
LigandBDBM17289
Substrate/Competitorn/a
Meas. Tech.ChEMBL_773113 (CHEMBL1839049)
IC50 51000±n/a nM
Citation Phan, CMLiu, YKim, BMMostafa, YTaylor, SD Inhibition of steroid sulfatase with 4-substituted estrone and estradiol derivatives. Bioorg Med Chem19:5999-6005 (2011) 
 
Steryl-sulfatase
Name:Steryl-sulfatase
Type:Enzyme
Mol. Mass.:65503.66
Organism:Homo sapiens (Human)
Description:P08842
Residue:583
BDBM17289
NameBDBM17289
Synonyms:(1S,10R,11S,15S)-5-hydroxy-15-methyltetracyclo[8.7.0.0^{2,7}.0^{11,15}]heptadeca-2,4,6-trien-14-one Estrone Estrone, 15 Kestrone Unigen [2,4,6,7-3H]-Estrone | folliculin
TypeSteroid
Emp. Form.C18H22O2
Mol. Mass.270.3661
SMILES[H][C@@]12CCC(=O)[C@@]1(C)CC[C@]1([H])c3ccc(O)cc3CC[C@@]21[H]