Reaction Details
TargetCytochrome P450 1A2
LigandBDBM50355391
Substrate/Competitorn/a
Meas. Tech.ChEMBL_772076 (CHEMBL1837842)
IC50>10000±n/a nM
Citation Guagnano, VFuret, PSpanka, CBordas, VLe Douget, MStamm, CBrueggen, JJensen, MRSchnell, CSchmid, HWartmann, MBerghausen, JDrueckes, PZimmerlin, ABussiere, DMurray, JGraus Porta, D Discovery of 3-(2,6-dichloro-3,5-dimethoxy-phenyl)-1-{6-[4-(4-ethyl-piperazin-1-yl)-phenylamino]-pyrimidin-4-yl}-1-methyl-urea (NVP-BGJ398), a potent and selective inhibitor of the fibroblast growth factor receptor family of receptor tyrosine kinase. J Med Chem54:7066-83 (2011) 
 
Cytochrome P450 1A2
Name:Cytochrome P450 1A2
Type:Enzyme
Mol. Mass.:58423.38
Organism:Homo sapiens (Human)
Description:P05177
Residue:516
BDBM50355391
NameBDBM50355391
Synonyms:CHEMBL1834659
TypeSmall organic molecule
Emp. Form.C26H30Cl2N6O4
Mol. Mass.561.46
SMILESCOc1cc(OC)c(Cl)c(NC(=O)N(C)c2cc(Nc3ccc(OCCN4CCCC4)cc3)ncn2)c1Cl