Reaction Details
TargetCytochrome P450 2D6
LigandBDBM50355392
Substrate/Competitorn/a
Meas. Tech.ChEMBL_772075 (CHEMBL1837841)
IC50>10000±n/a nM
Citation Guagnano, VFuret, PSpanka, CBordas, VLe Douget, MStamm, CBrueggen, JJensen, MRSchnell, CSchmid, HWartmann, MBerghausen, JDrueckes, PZimmerlin, ABussiere, DMurray, JGraus Porta, D Discovery of 3-(2,6-dichloro-3,5-dimethoxy-phenyl)-1-{6-[4-(4-ethyl-piperazin-1-yl)-phenylamino]-pyrimidin-4-yl}-1-methyl-urea (NVP-BGJ398), a potent and selective inhibitor of the fibroblast growth factor receptor family of receptor tyrosine kinase. J Med Chem54:7066-83 (2011) 
 
Cytochrome P450 2D6
Name:Cytochrome P450 2D6
Type:Protein
Mol. Mass.:55774.82
Organism:Homo sapiens (Human)
Description:P10635
Residue:497
BDBM50355392
NameBDBM50355392
Synonyms:CHEMBL1834658
TypeSmall organic molecule
Emp. Form.C25H29Cl2N7O3
Mol. Mass.546.449
SMILESCOc1cc(OC)c(Cl)c(NC(=O)N(C)c2cc(Nc3cccc(c3)N3CCN(C)CC3)ncn2)c1Cl