Reaction Details
TargetProto-oncogene tyrosine-protein kinase receptor Ret
LigandBDBM50355393
Substrate/Competitorn/a
Meas. Tech.ChEMBL_773556 (CHEMBL1839922)
IC50 3352±n/a nM
Citation Guagnano, VFuret, PSpanka, CBordas, VLe Douget, MStamm, CBrueggen, JJensen, MRSchnell, CSchmid, HWartmann, MBerghausen, JDrueckes, PZimmerlin, ABussiere, DMurray, JGraus Porta, D Discovery of 3-(2,6-dichloro-3,5-dimethoxy-phenyl)-1-{6-[4-(4-ethyl-piperazin-1-yl)-phenylamino]-pyrimidin-4-yl}-1-methyl-urea (NVP-BGJ398), a potent and selective inhibitor of the fibroblast growth factor receptor family of receptor tyrosine kinase. J Med Chem54:7066-83 (2011) 
 
Proto-oncogene tyrosine-protein kinase receptor Ret
Name:Proto-oncogene tyrosine-protein kinase receptor Ret
Type:Protein
Mol. Mass.:124318.29
Organism:Homo sapiens (Human)
Description:P07949
Residue:1114
BDBM50355393
NameBDBM50355393
Synonyms:BGJ398 US9434697, BGJ398 | US9730931, BGJ398
TypeSmall organic molecule
Emp. Form.C26H31Cl2N7O3
Mol. Mass.560.475
SMILESCCN1CCN(CC1)c1ccc(Nc2cc(ncn2)N(C)C(=O)Nc2c(Cl)c(OC)cc(OC)c2Cl)cc1