Reaction Details
TargetCytochrome P450 2D6
LigandBDBM50355405
Substrate/Competitorn/a
Meas. Tech.ChEMBL_773773 (CHEMBL1840139)
IC50>75000±n/a nM
Citation Lim, JTaoka, BOtte, RDSpencer, KDinsmore, CJAltman, MDChan, GRosenstein, CSharma, SSu, HPSzewczak, AAXu, LYin, HZugay-Murphy, JMarshall, CGYoung, JR Discovery of 1-amino-5H-pyrido[4,3-b]indol-4-carboxamide inhibitors of Janus kinase 2 (JAK2) for the treatment of myeloproliferative disorders. J Med Chem54:7334-49 (2011) 
 
Cytochrome P450 2D6
Name:Cytochrome P450 2D6
Type:Protein
Mol. Mass.:55774.82
Organism:Homo sapiens (Human)
Description:P10635
Residue:497
BDBM50355405
NameBDBM50355405
Synonyms:CHEMBL1835153
TypeSmall organic molecule
Emp. Form.C21H18F3N7O
Mol. Mass.441.4091
SMILESNC(=O)c1cnc(N[C@H](C2CC2)C(F)(F)F)c2c3ccc(cc3[nH]c12)-c1cnc(N)nc1