Reaction Details
TargetVoltage-dependent L-type calcium channel subunit alpha-1C
LigandBDBM50355405
Substrate/Competitorn/a
Meas. Tech.ChEMBL_773769 (CHEMBL1840135)
IC50>30000±n/a nM
Citation Lim, JTaoka, BOtte, RDSpencer, KDinsmore, CJAltman, MDChan, GRosenstein, CSharma, SSu, HPSzewczak, AAXu, LYin, HZugay-Murphy, JMarshall, CGYoung, JR Discovery of 1-amino-5H-pyrido[4,3-b]indol-4-carboxamide inhibitors of Janus kinase 2 (JAK2) for the treatment of myeloproliferative disorders. J Med Chem54:7334-49 (2011) 
 
Voltage-dependent L-type calcium channel subunit alpha-1C
Name:Voltage-dependent L-type calcium channel subunit alpha-1C
Type:Enzyme Catalytic Domain
Mol. Mass.:243492.26
Organism:RAT
Description:Calcium channel 0 RAT::P22002
Residue:2169
BDBM50355405
NameBDBM50355405
Synonyms:CHEMBL1835153
TypeSmall organic molecule
Emp. Form.C21H18F3N7O
Mol. Mass.441.4091
SMILESNC(=O)c1cnc(N[C@H](C2CC2)C(F)(F)F)c2c3ccc(cc3[nH]c12)-c1cnc(N)nc1