Reaction Details
TargetInterleukin-1 receptor-associated kinase 4
LigandBDBM50355466
Substrate/Competitorn/a
Meas. Tech.ChEMBL_773460 (CHEMBL1840412)
Ki 1200±n/a nM
Citation Davies, RJPierce, ACForster, CGrey, RXu, JArnost, MChoquette, DGalullo, VTian, SKHenkel, GChen, GHeidary, DKMa, JStuver-Moody, CNamchuk, M Design, synthesis, and evaluation of a novel dual FMS-like tyrosine kinase 3/stem cell factor receptor (FLT3/c-KIT) inhibitor for the treatment of acute myelogenous leukemia. J Med Chem54:7184-92 (2011) 
 
Interleukin-1 receptor-associated kinase 4
Name:Interleukin-1 receptor-associated kinase 4
Type:Protein
Mol. Mass.:51519.08
Organism:Homo sapiens (Human)
Description:Q9NWZ3
Residue:460
BDBM50355466
NameBDBM50355466
Synonyms:CHEMBL1835742
TypeSmall organic molecule
Emp. Form.C13H11ClN6
Mol. Mass.286.72
SMILESNc1nc(Nc2ccccc2Cl)nn1-c1ccccn1