Reaction Details
TargetAurora kinase A
LigandBDBM50355468
Substrate/Competitorn/a
Meas. Tech.ChEMBL_773458 (CHEMBL1840410)
Ki>3000±n/a nM
Citation Davies, RJPierce, ACForster, CGrey, RXu, JArnost, MChoquette, DGalullo, VTian, SKHenkel, GChen, GHeidary, DKMa, JStuver-Moody, CNamchuk, M Design, synthesis, and evaluation of a novel dual FMS-like tyrosine kinase 3/stem cell factor receptor (FLT3/c-KIT) inhibitor for the treatment of acute myelogenous leukemia. J Med Chem54:7184-92 (2011) 
 
Aurora kinase A
Name:Aurora kinase A
Type:Serine/threonine-protein kinase
Mol. Mass.:45830.98
Organism:Homo sapiens (Human)
Description:O14965
Residue:403
BDBM50355468
NameBDBM50355468
Synonyms:CHEMBL1835743
TypeSmall organic molecule
Emp. Form.C17H18FN7O
Mol. Mass.355.3695
SMILESNc1nc(Nc2cc(ccc2F)N2CCOCC2)nn1-c1ccccn1