Reaction Details
TargetInterleukin-1 receptor-associated kinase 4
LigandBDBM50355469
Substrate/Competitorn/a
Meas. Tech.ChEMBL_773460 (CHEMBL1840412)
Ki 36±n/a nM
Citation Davies, RJPierce, ACForster, CGrey, RXu, JArnost, MChoquette, DGalullo, VTian, SKHenkel, GChen, GHeidary, DKMa, JStuver-Moody, CNamchuk, M Design, synthesis, and evaluation of a novel dual FMS-like tyrosine kinase 3/stem cell factor receptor (FLT3/c-KIT) inhibitor for the treatment of acute myelogenous leukemia. J Med Chem54:7184-92 (2011) 
 
Interleukin-1 receptor-associated kinase 4
Name:Interleukin-1 receptor-associated kinase 4
Type:Protein
Mol. Mass.:51519.08
Organism:Homo sapiens (Human)
Description:Q9NWZ3
Residue:460
BDBM50355469
NameBDBM50355469
Synonyms:CHEMBL1835744
TypeSmall organic molecule
Emp. Form.C14H10ClN7
Mol. Mass.311.729
SMILESNc1nc(Nc2ccccc2Cl)nn1-c1ccc(cn1)C#N