Reaction Details
TargetMast/stem cell growth factor receptor Kit
LigandBDBM50355470
Substrate/Competitorn/a
Meas. Tech.ChEMBL_773457 (CHEMBL1840409)
Ki 205±n/a nM
Citation Davies, RJPierce, ACForster, CGrey, RXu, JArnost, MChoquette, DGalullo, VTian, SKHenkel, GChen, GHeidary, DKMa, JStuver-Moody, CNamchuk, M Design, synthesis, and evaluation of a novel dual FMS-like tyrosine kinase 3/stem cell factor receptor (FLT3/c-KIT) inhibitor for the treatment of acute myelogenous leukemia. J Med Chem54:7184-92 (2011) 
 
Mast/stem cell growth factor receptor Kit
Name:Mast/stem cell growth factor receptor Kit
Type:Protein
Mol. Mass.:109869.37
Organism:Homo sapiens (Human)
Description:P10721
Residue:976
BDBM50355470
NameBDBM50355470
Synonyms:CHEMBL1835745
TypeSmall organic molecule
Emp. Form.C19H20N8O2
Mol. Mass.392.4145
SMILESCOc1cc(ccc1Nc1nc(N)n(n1)-c1ccc(cn1)C#N)N1CCOCC1