Reaction Details
TargetReceptor-type tyrosine-protein kinase FLT3
LigandBDBM50355479
Substrate/Competitorn/a
Meas. Tech.ChEMBL_773456 (CHEMBL1840408)
Ki 1±n/a nM
Citation Davies, RJPierce, ACForster, CGrey, RXu, JArnost, MChoquette, DGalullo, VTian, SKHenkel, GChen, GHeidary, DKMa, JStuver-Moody, CNamchuk, M Design, synthesis, and evaluation of a novel dual FMS-like tyrosine kinase 3/stem cell factor receptor (FLT3/c-KIT) inhibitor for the treatment of acute myelogenous leukemia. J Med Chem54:7184-92 (2011) 
 
Receptor-type tyrosine-protein kinase FLT3
Name:Receptor-type tyrosine-protein kinase FLT3
Type:Enzyme
Mol. Mass.:112888.62
Organism:Homo sapiens (Human)
Description:P36888
Residue:993
BDBM50355479
NameBDBM50355479
Synonyms:CHEMBL1835746
TypeSmall organic molecule
Emp. Form.C17H23N9O
Mol. Mass.369.4242
SMILESCOc1ccccc1Nc1nc(N)n(n1)-c1cc(NCCN(C)C)ncn1