Reaction Details
TargetReceptor-type tyrosine-protein kinase FLT3
LigandBDBM50355483
Substrate/Competitorn/a
Meas. Tech.ChEMBL_773456 (CHEMBL1840408)
Ki 7±n/a nM
Citation Davies, RJPierce, ACForster, CGrey, RXu, JArnost, MChoquette, DGalullo, VTian, SKHenkel, GChen, GHeidary, DKMa, JStuver-Moody, CNamchuk, M Design, synthesis, and evaluation of a novel dual FMS-like tyrosine kinase 3/stem cell factor receptor (FLT3/c-KIT) inhibitor for the treatment of acute myelogenous leukemia. J Med Chem54:7184-92 (2011) 
 
Receptor-type tyrosine-protein kinase FLT3
Name:Receptor-type tyrosine-protein kinase FLT3
Type:Enzyme
Mol. Mass.:112888.62
Organism:Homo sapiens (Human)
Description:P36888
Residue:993
BDBM50355483
NameBDBM50355483
Synonyms:CHEMBL1835750
TypeSmall organic molecule
Emp. Form.C21H27N7O2
Mol. Mass.409.4848
SMILESNc1nc(Nc2ccc(cc2)C(O)CCCN2CCOCC2)nn1-c1ccccn1