Reaction Details
TargetMast/stem cell growth factor receptor Kit
LigandBDBM50355480
Substrate/Competitorn/a
Meas. Tech.ChEMBL_773457 (CHEMBL1840409)
Ki 18±n/a nM
Citation Davies, RJPierce, ACForster, CGrey, RXu, JArnost, MChoquette, DGalullo, VTian, SKHenkel, GChen, GHeidary, DKMa, JStuver-Moody, CNamchuk, M Design, synthesis, and evaluation of a novel dual FMS-like tyrosine kinase 3/stem cell factor receptor (FLT3/c-KIT) inhibitor for the treatment of acute myelogenous leukemia. J Med Chem54:7184-92 (2011) 
 
Mast/stem cell growth factor receptor Kit
Name:Mast/stem cell growth factor receptor Kit
Type:Protein
Mol. Mass.:109869.37
Organism:Homo sapiens (Human)
Description:P10721
Residue:976
BDBM50355480
NameBDBM50355480
Synonyms:CHEMBL1835747
TypeSmall organic molecule
Emp. Form.C17H19N7O
Mol. Mass.337.3791
SMILESNc1nc(Nc2ccc(cc2)N2CCOCC2)nn1-c1ccccn1