Reaction Details
TargetUDP-glucuronosyltransferase 1A1
LigandBDBM13066
Substrate/Competitorn/a
Meas. Tech.ChEMBL_774120 (CHEMBL1908125)
Ki 52000±n/a nM
Citation Kiang, TKEnsom, MHChang, TK UDP-glucuronosyltransferases and clinical drug-drug interactions. Pharmacol Ther106:97-132 (2005) 
 
UDP-glucuronosyltransferase 1A1
Name:UDP-glucuronosyltransferase 1A1
Type:Enzyme
Mol. Mass.:59604.34
Organism:Homo sapiens (Human)
Description:P22309
Residue:533
BDBM13066
NameBDBM13066
Synonyms:2-{2-[(2,6-dichlorophenyl)amino]phenyl}acetic acid Diclofenac US11478464, Compound Diclofenac {2-[(2,6-dichlorophenyl)amino]phenyl}acetic acid
TypeSmall organic molecule
Emp. Form.C14H11Cl2NO2
Mol. Mass.296.149
SMILESOC(=O)Cc1ccccc1Nc1c(Cl)cccc1Cl