Reaction Details
TargetUDP-glucuronosyltransferase 1A1
LigandBDBM50206509
Substrate/Competitorn/a
Meas. Tech.ChEMBL_774120 (CHEMBL1908125)
Ki 221000±n/a nM
Citation Kiang, TKEnsom, MHChang, TK UDP-glucuronosyltransferases and clinical drug-drug interactions. Pharmacol Ther106:97-132 (2005) 
 
UDP-glucuronosyltransferase 1A1
Name:UDP-glucuronosyltransferase 1A1
Type:Enzyme
Mol. Mass.:59604.34
Organism:Homo sapiens (Human)
Description:P22309
Residue:533
BDBM50206509
NameBDBM50206509
Synonyms:4-Dipropylsulfamoyl-benzoic acid 4-Dipropylsulfamoyl-benzoic acid(probenecid) CHEMBL897 Probalan
TypeSmall organic molecule
Emp. Form.C13H19NO4S
Mol. Mass.285.359
SMILESCCCN(CCC)S(=O)(=O)c1ccc(cc1)C(O)=O