Reaction Details
TargetUDP-glucuronosyltransferase 2B7
LigandBDBM50003616
Substrate/Competitorn/a
Meas. Tech.ChEMBL_774127 (CHEMBL1908132)
Ki 1600000±n/a nM
Citation Kiang, TKEnsom, MHChang, TK UDP-glucuronosyltransferases and clinical drug-drug interactions. Pharmacol Ther106:97-132 (2005) 
 
UDP-glucuronosyltransferase 2B7
Name:UDP-glucuronosyltransferase 2B7
Type:Enzyme
Mol. Mass.:60705.98
Organism:Homo sapiens (Human)
Description:P16662
Residue:529
BDBM50003616
NameBDBM50003616
Synonyms:2-n-propyl-n-valeric acid DPA VALPROIC ACID dipropylacetic acid | n-DPA
TypeSmall organic molecule
Emp. Form.C8H16O2
Mol. Mass.144.2114
SMILESCCCC(CCC)C(O)=O