Reaction Details
TargeteIF-2-alpha kinase GCN2
LigandBDBM31093
Substrate/Competitorn/a
Meas. Tech.ChEMBL_774290 (CHEMBL1908507)
Kd>10000±n/a nM
Citation Davis, MIHunt, JPHerrgard, SCiceri, PWodicka, LMPallares, GHocker, MTreiber, DKZarrinkar, PP Comprehensive analysis of kinase inhibitor selectivity. Nat Biotechnol29:1046-51 (2011) 
 
eIF-2-alpha kinase GCN2
Name:eIF-2-alpha kinase GCN2
Type:PROTEIN
Mol. Mass.:186899.26
Organism:Homo sapiens (Human)
Description:ChEMBL_1495738
Residue:1649
BDBM31093
NameBDBM31093
Synonyms:4-[[7-[2,6-bis(fluoranyl)phenyl]-9-chloranyl-5H-pyrimido[5,4-d][2]benzazepin-2-yl]amino]benzoic acid BDBM31832 MLN-8054 | cid_11712649
TypeSmall organic molecule
Emp. Form.C25H15ClF2N4O2
Mol. Mass.476.862
SMILESOC(=O)c1ccc(Nc2ncc3CN=C(c4cc(Cl)ccc4-c3n2)c2c(F)cccc2F)cc1