Reaction Details
TargetSerine/threonine-protein kinase tousled-like 2
LigandBDBM50026612
Substrate/Competitorn/a
Meas. Tech.ChEMBL_774251 (CHEMBL1908468)
Kd>10000±n/a nM
Citation Davis, MIHunt, JPHerrgard, SCiceri, PWodicka, LMPallares, GHocker, MTreiber, DKZarrinkar, PP Comprehensive analysis of kinase inhibitor selectivity. Nat Biotechnol29:1046-51 (2011) 
 
Serine/threonine-protein kinase tousled-like 2
Name:Serine/threonine-protein kinase tousled-like 2
Type:PROTEIN
Mol. Mass.:87680.67
Organism:Homo sapiens (Human)
Description:ChEMBL_1510767
Residue:772
BDBM50026612
NameBDBM50026612
Synonyms:BIBF-1120 US10981896, Compound Nintedanib US11208381, Nintedanib | Vargatef
TypeSmall organic molecule
Emp. Form.C31H33N5O4
Mol. Mass.539.6248
SMILESCOC(=O)c1ccc2\C(=C(\Nc3ccc(cc3)N(C)C(=O)CN3CCN(C)CC3)c3ccccc3)C(=O)Nc2c1