Reaction Details
TargetCalcium/calmodulin-dependent protein kinase kinase 2
LigandBDBM25084
Substrate/Competitorn/a
Meas. Tech.ChEMBL_774540 (CHEMBL1908757)
Kd>10000±n/a nM
Citation Davis, MIHunt, JPHerrgard, SCiceri, PWodicka, LMPallares, GHocker, MTreiber, DKZarrinkar, PP Comprehensive analysis of kinase inhibitor selectivity. Nat Biotechnol29:1046-51 (2011) 
 
Calcium/calmodulin-dependent protein kinase kinase 2
Name:Calcium/calmodulin-dependent protein kinase kinase 2
Type:Enzyme Catalytic Domain
Mol. Mass.:64746.61
Organism:Homo sapiens (Human)
Description:gi_27437015
Residue:588
BDBM25084
NameBDBM25084
Synonyms:3-[2,4-diamino-6-(3-hydroxyphenyl)pteridin-7-yl]phenol TG100-115
TypeSmall organic molecule
Emp. Form.C18H14N6O2
Mol. Mass.346.3428
SMILESNc1nc(N)c2nc(-c3cccc(O)c3)c(nc2n1)-c1cccc(O)c1