Reaction Details
TargetRibosomal protein S6 kinase alpha-4
LigandBDBM50355497
Substrate/Competitorn/a
Meas. Tech.ChEMBL_774286 (CHEMBL1908503)
Kd>10000±n/a nM
Citation Davis, MIHunt, JPHerrgard, SCiceri, PWodicka, LMPallares, GHocker, MTreiber, DKZarrinkar, PP Comprehensive analysis of kinase inhibitor selectivity. Nat Biotechnol29:1046-51 (2011) 
 
Ribosomal protein S6 kinase alpha-4
Name:Ribosomal protein S6 kinase alpha-4
Type:Serine/threonine-protein kinase
Mol. Mass.:85620.38
Organism:Homo sapiens (Human)
Description:Recombinant MSK2 was phosphorylated by incubation with active p38alpha before assays.
Residue:772
BDBM50355497
NameBDBM50355497
Synonyms:AZD-6244 | CHEMBL1614701
TypeSmall organic molecule
Emp. Form.C17H15BrClFN4O3
Mol. Mass.457.681
SMILESCn1cnc2c(F)c(Nc3ccc(Br)cc3Cl)c(cc12)C(=O)NOCCO